WIP

3 jobs for !36 with 5-add-test-for-conditions-in-output-nodes in 1 minute and 5 seconds (queued for 5 seconds)
merge request
Name Stage Failure
failed
test-3.6 Test
FAILED ewoksppf/tests/test_ppf_workflow21.py::test_workflow21[True-False-args0]
FAILED ewoksppf/tests/test_ppf_workflow21.py::test_workflow21[True-False-args1]
FAILED ewoksppf/tests/test_ppf_workflow21.py::test_workflow21[False-True-args0]
FAILED ewoksppf/tests/test_ppf_workflow21.py::test_workflow21[False-True-args1]
FAILED ewoksppf/tests/test_ppf_workflow21.py::test_workflow21[False-False-args0]
FAILED ewoksppf/tests/test_ppf_workflow21.py::test_workflow21[False-False-args1]
=================== 8 failed, 31 passed, 4 skipped in 28.49s ===================
Cleaning up project directory and file based variables
ERROR: Job failed: exit code 1