WIP

3 jobs for !36 with 5-add-test-for-conditions-in-output-nodes in 1 minute and 5 seconds (queued for 5 seconds)
detached
Status Name Job ID Coverage
  Style
passed black #289769

00:00:11

passed flake8 #289768

00:00:11

 
  Test
failed test-3.6 #289770

00:00:53

90.0%
 
Name Stage Failure
failed
test-3.6 Test
FAILED ewoksppf/tests/test_ppf_workflow21.py::test_workflow21[True-False-args0]
FAILED ewoksppf/tests/test_ppf_workflow21.py::test_workflow21[True-False-args1]
FAILED ewoksppf/tests/test_ppf_workflow21.py::test_workflow21[False-True-args0]
FAILED ewoksppf/tests/test_ppf_workflow21.py::test_workflow21[False-True-args1]
FAILED ewoksppf/tests/test_ppf_workflow21.py::test_workflow21[False-False-args0]
FAILED ewoksppf/tests/test_ppf_workflow21.py::test_workflow21[False-False-args1]
=================== 8 failed, 31 passed, 4 skipped in 28.49s ===================
Cleaning up project directory and file based variables
ERROR: Job failed: exit code 1