try yet another version of jupyter client

8 jobs for master in 13 minutes and 23 seconds (queued for 8 seconds)
Status Name Job ID Coverage
  Style
passed check_style #261516

00:00:18

 
  Build
passed doc #261517
linux

00:05:02

 
  Test
failed check_lint #261521
linux

00:02:09

failed test:python3.7-stretch-pyqt5_larch #261519

00:03:40

failed test:python3.7-stretch-pyqt5_pymca #261518

00:04:41

failed test:python3.7-stretch-pyqt5_pymca_larch #261520

00:06:29

50.0%
passed test:test-est-tutorials_pymca #261522

00:03:20

 
  Deploy
skipped pages #261523
linux
 
Name Stage Failure
failed
test:python3.7-stretch-pyqt5_pymca_larch Test

=========================== short test summary info ============================
FAILED est/app/test/test_exec.py::TestWorkflowFromOwsFile::testLarchExecWorkflow
FAILED est/app/test/test_exec.py::TestWorkflowFromOwsFile::testPymcaExecWorkflow
FAILED est/test/test_ewoks.py::TestOrangeGraph::test_orange_graph_larch - Mod...
FAILED est/test/test_ewoks.py::TestOrangeGraph::test_orange_graph_pymca - Mod...
=========== 4 failed, 58 passed, 1569 warnings in 105.11s (0:01:45) ============
Cleaning up project directory and file based variables
ERROR: Job failed: exit code 1

failed
check_lint Test
ModuleNotFoundError: No module named 'PyMca5'
ModuleNotFoundError: No module named 'PyMca5'

You can ignore this error by setting the following in conf.py:

nbsphinx_allow_errors = True

Cleaning up project directory and file based variables
ERROR: Job failed: exit code 1

failed
test:python3.7-stretch-pyqt5_pymca Test

-- Docs: https://docs.pytest.org/en/stable/warnings.html
=========================== short test summary info ============================
FAILED est/app/test/test_exec.py::TestWorkflowFromOwsFile::testLarchExecWorkflow
FAILED est/app/test/test_exec.py::TestWorkflowFromOwsFile::testPymcaExecWorkflow
FAILED est/test/test_ewoks.py::TestOrangeGraph::test_orange_graph_pymca - Mod...
====== 3 failed, 38 passed, 21 skipped, 1534 warnings in 79.59s (0:01:19) ======
Cleaning up project directory and file based variables
ERROR: Job failed: exit code 1

failed
test:python3.7-stretch-pyqt5_larch Test
  /builds/workflow/est/est/core/types/spectra.py:90: VisibleDeprecationWarning: Creating an ndarray from ragged nested sequences (which is a list-or-tuple of lists-or-tuples-or ndarrays with different lengths or shapes) is deprecated. If you meant to do this, you must specify 'dtype=object' when creating the ndarray.
self.__data = numpy.array(spectrum_list)

-- Docs: https://docs.pytest.org/en/stable/warnings.html
=========================== short test summary info ============================
FAILED est/test/test_ewoks.py::TestOrangeGraph::test_orange_graph_larch - Mod...
============ 1 failed, 32 passed, 29 skipped, 24 warnings in 40.86s ============
Cleaning up project directory and file based variables
ERROR: Job failed: exit code 1