h52nx: check more data on parent root for z series

4 jobs for fix_106 in 4 minutes and 13 seconds (queued for 2 seconds)
Name Stage Failure
failed
test:python3.9-buster Test
FAILED nxtomomill/converter/hdf5/test/test_hdf5converter.py::test_simple_conversion[int16]
FAILED nxtomomill/converter/hdf5/test/test_hdf5converter.py::test_simple_conversion[int32]
FAILED nxtomomill/converter/hdf5/test/test_hdf5converter.py::test_simple_conversion[int64]
FAILED nxtomomill/nexus/test/test_nxtomo.py::test_nx_tomo[1.1] - AttributeErr...
FAILED nxtomomill/nexus/test/test_nxtomo.py::test_nx_tomo[1.0] - AttributeErr...
FAILED nxtomomill/nexus/test/test_nxtomo.py::test_nx_tomo[None] - AttributeEr...
======================= 17 failed, 123 passed in 22.24s ========================
Cleaning up project directory and file based variables
ERROR: Job failed: exit code 1

failed
test:python3.7-stretch Test
FAILED nxtomomill/converter/hdf5/test/test_hdf5converter.py::test_simple_conversion[int16]
FAILED nxtomomill/converter/hdf5/test/test_hdf5converter.py::test_simple_conversion[int32]
FAILED nxtomomill/converter/hdf5/test/test_hdf5converter.py::test_simple_conversion[int64]
FAILED nxtomomill/nexus/test/test_nxtomo.py::test_nx_tomo[1.1] - AttributeErr...
FAILED nxtomomill/nexus/test/test_nxtomo.py::test_nx_tomo[1.0] - AttributeErr...
FAILED nxtomomill/nexus/test/test_nxtomo.py::test_nx_tomo[None] - AttributeEr...
======================= 17 failed, 123 passed in 21.59s ========================
Cleaning up project directory and file based variables
ERROR: Job failed: exit code 1

failed
test:test-nxtomomill-tutorials Test
--> 449             data_path="/".join([data_path, nexus_detector_paths.MAGNIFICATION]),
450 )
451 self.distance, self.distance.unit = get_data_and_unit(

AttributeError: type object 'NEXUS_DETECTOR_PATH_V_1_2' has no attribute 'MAGNIFICATION'
AttributeError: type object 'NEXUS_DETECTOR_PATH_V_1_2' has no attribute 'MAGNIFICATION'

Cleaning up project directory and file based variables
ERROR: Job failed: exit code 1