try to speed up reconstruction

2 jobs for reconstruction_slice_several_cor_opti in 4 minutes and 28 seconds (queued for 1 second)
latest
Status Name Job ID Coverage
  Test
failed linux_docker #184681
docker

00:04:28

failed linux_shell #184680
shell

00:04:17

 
Name Stage Failure
failed
linux_shell Test
FAILED ../../../../../../../../dev/shm/gitlab_ci/nabu/venv/lib/python3.8/site-packages/nabu/preproc/tests/test_flatfield.py::TestFlatField::test_flatfield_simple_subregion
FAILED ../../../../../../../../dev/shm/gitlab_ci/nabu/venv/lib/python3.8/site-packages/nabu/preproc/tests/test_flatfield.py::TestFlatField::test_flatfield_linear_interp
FAILED ../../../../../../../../dev/shm/gitlab_ci/nabu/venv/lib/python3.8/site-packages/nabu/preproc/tests/test_flatfield.py::TestFlatField::test_cuda_flatfield
FAILED ../../../../../../../../dev/shm/gitlab_ci/nabu/venv/lib/python3.8/site-packages/nabu/preproc/tests/test_flatfield.py::TestFlatFieldH5::test_flatfield
FAILED ../../../../../../../../dev/shm/gitlab_ci/nabu/venv/lib/python3.8/site-packages/nabu/preproc/tests/test_flatfield.py::TestFlatFieldH5::test_cuda_flatfield
FAILED ../../../../../../../../dev/shm/gitlab_ci/nabu/venv/lib/python3.8/site-packages/nabu/preproc/tests/test_flatfield.py::TestFlatFieldMultiFlat::test_flatfield
FAILED ../../../../../../../../dev/shm/gitlab_ci/nabu/venv/lib/python3.8/site-packages/nabu/preproc/tests/test_flatfield.py::TestFlatFieldMultiFlat::test_cuda_flatfield
==== 8 failed, 107 passed, 35 skipped, 58830 warnings in 240.34s (0:04:00) =====
ERROR: Job failed: exit status 1
failed
linux_docker Test
=========================== short test summary info ============================
FAILED ../../../root/gitlab_ci/nabu/venv/lib/python3.7/site-packages/nabu/preproc/tests/test_flatfield.py::TestFlatField::test_flatfield_simple
FAILED ../../../root/gitlab_ci/nabu/venv/lib/python3.7/site-packages/nabu/preproc/tests/test_flatfield.py::TestFlatField::test_flatfield_simple_subregion
FAILED ../../../root/gitlab_ci/nabu/venv/lib/python3.7/site-packages/nabu/preproc/tests/test_flatfield.py::TestFlatField::test_flatfield_linear_interp
FAILED ../../../root/gitlab_ci/nabu/venv/lib/python3.7/site-packages/nabu/preproc/tests/test_flatfield.py::TestFlatFieldH5::test_flatfield
FAILED ../../../root/gitlab_ci/nabu/venv/lib/python3.7/site-packages/nabu/preproc/tests/test_flatfield.py::TestFlatFieldMultiFlat::test_flatfield
==== 5 failed, 43 passed, 102 skipped, 58808 warnings in 229.70s (0:03:49) =====
Cleaning up file based variables
ERROR: Job failed: exit code 1