updated move for CalcController with numerous reals

8 jobs for !3999 with 2955-updated_move in 84 minutes and 4 seconds (queued for 8 seconds)
detached
Status Name Job ID Coverage
  Style
passed check_lint #261432

00:01:37

100.0%
passed check_style #261431

00:01:33

 
  Tests
failed test_bliss #261433

01:22:26

100.0%
manual test_bliss_windows #261436
conda win allowed to fail manual
passed test_qt #261434

00:07:59

100.0%
passed test_writer #261435

00:33:59

100.0%
 
  Build
passed create_reference_doc #261437

00:07:03

passed create_user_doc #261438

00:04:42

 
Name Stage Failure
failed
test_bliss Tests
FAILED tests/motors/test_calccontroller.py::test_issue_1909 - ValueError: not...
FAILED tests/scans/test_mesh_scans.py::test_dmesh - ValueError: not enough va...
FAILED tests/scans/test_mesh_scans.py::test_d3mesh - ValueError: not enough v...
FAILED tests/scans/test_mesh_scans.py::test_dmesh_return_to_target_pos - Valu...
FAILED tests/shell/test_standard.py::test_umv_typecheck - ValueError: not eno...
FAILED tests/shell/test_standard.py::test_umv_shell - ValueError: not enough ...
ERROR tests/test_hkl.py::test_zaxis - AssertionError: assert {140224221103......
= 7 failed, 1808 passed, 38 skipped, 22 xfailed, 13 warnings, 1 error in 4567.69s (1:16:07) =
ERROR: Job failed: exit code 1