fix

8 jobs for !3755 with 2789-web-shell-server-ui-component in 114 minutes and 30 seconds (queued for 7 seconds)
detached
Status Name Job ID Coverage
  Style
failed check_lint #255449
allowed to fail

00:01:07

passed check_style #255448

00:00:59

 
  Tests
failed test_bliss #255450

01:53:20

manual test_bliss_windows #255453
conda win allowed to fail manual
passed test_qt #255451

00:08:40

passed test_writer #255452

00:47:44

 
  Build
passed create_reference_doc #255454

00:10:10

passed create_user_doc #255455

00:05:31

 
Name Stage Failure
failed
test_bliss Tests
FAILED tests/session/test_session.py::test_failing_session_globals - TypeErro...
FAILED tests/shell/test_bliss_library.py::test_shell_script - AssertionError:...
FAILED tests/shell/test_bliss_shell_basics.py::test_elogbook_cmd_log_and_elog_add
FAILED tests/shell/test_bliss_shell_basics.py::test_excepthook - assert '' ==...
= 12 failed, 1858 passed, 38 skipped, 22 xfailed, 12 warnings in 6384.80s (1:46:24) =
Running after_script
Uploading artifacts for failed job
Authenticating with credentials from /root/.docker/config.json
ERROR: Job failed: exit code 1
failed
check_lint Style
bliss/shell/cli/web_repl.py:24:1: F401 'geventwebsocket.WebSocketApplication' imported but unused
bliss/shell/cli/web_repl.py:24:1: F401 'geventwebsocket.Resource' imported but unused
bliss/shell/cli/web_repl.py:28:1: F401 'gevent.fileobject.FileObjectThread as File' imported but unused
bliss/shell/cli/web_repl.py:32:1: F401 'prompt_toolkit.output.DummyOutput' imported but unused
bliss/shell/main.py:52:1: E402 module level import not at top of file
Running after_script
Uploading artifacts for failed job
Authenticating with credentials from /root/.docker/config.json
ERROR: Job failed: exit code 1